Feed_ID,Vehicle_ID,FullRegistration,Colour,FuelType,Year,Mileage,BodyType,Doors,Make,Model,Variant,EngineSize,Price,Transmission,PictureRefs,ServiceHistory,PreviousOwners,Category,FourWheelDrive,Options,Comments,New,Used,Site,Origin,V5,Condition,ExDemo,FranchiseApproved,TradePrice,TradePriceExtra,ServiceHistoryText,Cap_ID,MPG,co2,bhp,video_url
43,563288,YD66PXV,WHITE,Diesel,2016,35000,PICK UP,4,Toyota,Hi Lux,ACTIVE 4WD D-4D DCB,2393,16495,Manual,https://aacarsdna.com/images/vehicles/88/large/d8e68f1d082a4452d5e840c05ef5aa41.jpg,,,,,"Daytime Running Lights,Brake Assist,MP3 Player Connection,Steering Wheel Controls,Speakers,V5 Registration Document,MOT,Full Service History,1 Owner,Traction Control,Safety Belts Rear,Safety Belts,Radio,Particule Filter,Four Wheel Drive,Engine Immobiliser,Electric Mirrors,Bluetooth,Adjustable Steering,Front Airbags,Power Assisted Steering,Electric Windows,Central Locking,Alarm,Air Conditioning,ABS",We are still open for online business and we offer free nationwide delivery.,N,Y,,,,,,,,,,,40.4,185,147,
43,605093,MT18LWW,WHITE,Diesel,2018,25807,CHASSIS CAB,4,Ford,Transit,350 L4 C/C,1995,23995,Manual,"https://aacarsdna.com/images/vehicles/93/large/f781c366c31b257538556efbb6654176.jpg,https://aacarsdna.com/images/vehicles/93/large/497ec2a83bc4f3c9f944ced488813914.jpg,https://aacarsdna.com/images/vehicles/93/large/acfcbfa4fbb9d96df4fc56699a27e79c.jpg,https://aacarsdna.com/images/vehicles/93/large/adcc2110ca1c5009a4615e0dccb07264.jpg,https://aacarsdna.com/images/vehicles/93/large/8896cd1e42e663ef9ba229702b6cc475.jpg,https://aacarsdna.com/images/vehicles/93/large/33d378d0fff524b0ba589c80ade05d2f.jpg,https://aacarsdna.com/images/vehicles/93/large/fffd09e29f3bd75dcd98377ecc865d03.jpg,https://aacarsdna.com/images/vehicles/93/large/7b4767a10f19792f7edd0bbe2b241fa1.jpg,https://aacarsdna.com/images/vehicles/93/large/0b577257c792651ae3ccb3ac5df95561.jpg,https://aacarsdna.com/images/vehicles/93/large/29914be717229fa6dcbb85dba2bbaa1c.jpg",,,,,"Daytime Running Lights,Brake Assist,MP3 Player Connection,Steering Wheel Controls,Speakers,Cup Holders,Tuning,MOT,Full Service History,1 Owner,Trailer Coupling,Traction Control,Safety Belts Rear,Safety Belts,Radio,Particule Filter,Engine Immobiliser,Bluetooth,Adjustable Steering,Front Airbags,Power Assisted Steering,Electric Windows,Central Locking,Alarm,ABS",,N,Y,,,,,,,,,,,0,204,128,
43,609353,YP14DVG,WHITE,Diesel,2014,82000,PANEL VAN,5,Ford,Transit Custom,270 LR P/V,2198,7995,Manual,"https://aacarsdna.com/images/vehicles/53/large/353ce0800815baf9f7f1cea79a07a875.jpg,https://aacarsdna.com/images/vehicles/53/large/49083823247a989e2a2ca0b3ed32383a.jpg,https://aacarsdna.com/images/vehicles/53/large/07d95e8ffdb3bef02a77820e0440b18a.jpg,https://aacarsdna.com/images/vehicles/53/large/272841454c05b83f4c52bb2277a6ef91.jpg,https://aacarsdna.com/images/vehicles/53/large/5a9974b1ba828a78cd847afc229cc83a.jpg,https://aacarsdna.com/images/vehicles/53/large/1ac92444425f573125a0699d23ec7516.jpg,https://aacarsdna.com/images/vehicles/53/large/c18d90e891a7600b7f1f037283a57c12.jpg,https://aacarsdna.com/images/vehicles/53/large/8e9f4f75e8db742e8c8a2720c1df3846.jpg,https://aacarsdna.com/images/vehicles/53/large/6af09d0d50382ae1b7e7d357cb788740.jpg,https://aacarsdna.com/images/vehicles/53/large/b168c33da711d566e090a89fcfa3eebd.jpg,https://aacarsdna.com/images/vehicles/53/large/738adac68f6848cf8f598f500fd144b0.jpg",,,,,"Daytime Running Lights,Brake Assist,Service History,MP3 Player Connection,Steering Wheel Controls,Speakers,Privacy/Tinted Glass,Cup Holders,V5 Registration Document,MOT,1 Owner,Trailer Coupling,Traction Control,Safety Belts,Radio,Particule Filter,Engine Immobiliser,Bluetooth,Adjustable Steering,Front Airbags,Power Assisted Steering,Electric Windows,Central Locking,Alarm,ABS","One Owner , Ply Lined",N,Y,,,,,,,,,,,42.2,186,98,
43,613927,BL16PZD,WHITE,Diesel,2016,56000,CAR DERIVED VAN,5,Renault,Kangoo,ML19 BUSINESS DCI,1461,5995,Manual,"https://aacarsdna.com/images/vehicles/27/large/796d5149672586b27191a93357fc1b1f.jpg,https://aacarsdna.com/images/vehicles/27/large/f69a7ad851cec5c38b15a1e78c07f4ca.jpg,https://aacarsdna.com/images/vehicles/27/large/3435768e342bb7b3a182c3e5590514b1.jpg,https://aacarsdna.com/images/vehicles/27/large/3da0df08175976c4c0318be645f4f807.jpg,https://aacarsdna.com/images/vehicles/27/large/6a99c2e17ece191e2e1abaa847b2bbdd.jpg,https://aacarsdna.com/images/vehicles/27/large/928b2ece7b20966ae296f3bb14b400f0.jpg,https://aacarsdna.com/images/vehicles/27/large/ab823c12ee8a58b2258af669374ae5a9.jpg,https://aacarsdna.com/images/vehicles/27/large/465a5a0e080e266ddd7a7ea29e019507.jpg,https://aacarsdna.com/images/vehicles/27/large/71410910de8343776a365596a667df5a.jpg",,,,,"Brake Assist,ISOFix Anchor Point,MP3 Player Connection,Steering Wheel Controls,Speakers,Cup Holders,V5 Registration Document,MOT,Full Service History,1 Owner,Traction Control,Safety Belts,Radio,Particule Filter,Engine Immobiliser,Electric Mirrors,Bluetooth,Adjustable Steering,Front Airbags,Power Assisted Steering,Electric Windows,Central Locking,CD Player,Alarm,ABS",,N,Y,,,,,,,,,,,61.4,119,75,
43,619491,MT18EKG,WHITE,Diesel,2018,39000,PANEL VAN,6,Peugeot,Expert,BLUE HDI PROFESSIONAL COMPACT,1560,12995,Manual,"https://aacarsdna.com/images/vehicles/91/large/88940db0439605c58b63d8c15895f868.jpg,https://aacarsdna.com/images/vehicles/91/large/0d2a8ad7af49d42618e680d8738a222a.jpg,https://aacarsdna.com/images/vehicles/91/large/a880e5067ffde514be48089efeadf3a3.jpg,https://aacarsdna.com/images/vehicles/91/large/119dfcf2d9276923d9740b51f38139c5.jpg,https://aacarsdna.com/images/vehicles/91/large/9b55991381027cf34eecc7f61b240a77.jpg,https://aacarsdna.com/images/vehicles/91/large/8db1e49773064dbf14631742b6384ab2.jpg,https://aacarsdna.com/images/vehicles/91/large/2bedcee73eb115817a4048c3aaf33ca7.jpg,https://aacarsdna.com/images/vehicles/91/large/c82b75a5f43052269bc1c77af97635b8.jpg,https://aacarsdna.com/images/vehicles/91/large/ad901f92fbcf14c1d015efd457d6ba52.jpg,https://aacarsdna.com/images/vehicles/91/large/ef5902aa24db1aa49c348756f5d59923.jpg,https://aacarsdna.com/images/vehicles/91/large/0300114a57a0f807cc07c5228e24d49e.jpg,https://aacarsdna.com/images/vehicles/91/large/106c8cfa14e8f7d2f1a219a4d88e5c17.jpg",,,,,"Daytime Running Lights,Brake Assist,MP3 Player Connection,Speakers,Cup Holders,Speed Limiter,V5 Registration Document,Full Service History,1 Owner,Traction Control,Satellite Navigation,Safety Belts Rear,Safety Belts,Radio,Particule Filter,Parking Sensors,Engine Immobiliser,Electric Mirrors,Cruise Control,Bluetooth,Adjustable Steering,Front Airbags,Power Assisted Steering,Electric Windows,Central Locking,Alarm,Air Conditioning,ABS",Ply Lined Apple Car Play,N,Y,,,,,,,,,,,51.4,144,95,
43,620064,MW68HRA,WHITE,Diesel,2018,70600,PANEL VAN,5,Peugeot,Partner,BLUE HDI PROFESSIONAL L1,1560,7695,Manual,"https://aacarsdna.com/images/vehicles/64/large/08cd766fd797c5426f0ae0324d9f73bb.jpg,https://aacarsdna.com/images/vehicles/64/large/8d534053d5b9fdec93adec825abcbd45.jpg,https://aacarsdna.com/images/vehicles/64/large/af986dfb85be8c2869bab06a811a53ab.jpg,https://aacarsdna.com/images/vehicles/64/large/e7d49f1bb2a8c605129179a5ed6db3c9.jpg,https://aacarsdna.com/images/vehicles/64/large/8c46d1c24b1bae2bcd7fbe1be88bd63a.jpg,https://aacarsdna.com/images/vehicles/64/large/853adb3163ed6d92e93be92c6ecf8e91.jpg,https://aacarsdna.com/images/vehicles/64/large/d0f38e08b01d13d268d2292206df5987.jpg,https://aacarsdna.com/images/vehicles/64/large/8fad266169d64c9040de5d57560cb3ed.jpg,https://aacarsdna.com/images/vehicles/64/large/07af6bd9d1f5cc62f6058774df5e9619.jpg,https://aacarsdna.com/images/vehicles/64/large/b8d41e544369df4b32c0ad976cc1b5cc.jpg,https://aacarsdna.com/images/vehicles/64/large/bd0c47ca60b7f1372ace64fcfbadd979.jpg,https://aacarsdna.com/images/vehicles/64/large/47f61720637bafc803c7d96d71d5ae8a.jpg",,,,,"Brake Assist,MP3 Player Connection,Steering Wheel Controls,Speakers,Privacy/Tinted Glass,Cup Holders,Speed Limiter,V5 Registration Document,Full Service History,1 Owner,Traction Control,Satellite Navigation,Safety Belts,Radio,Parking Sensors,Engine Immobiliser,Electric Mirrors,Cruise Control,Bluetooth,Adjustable Steering,Front Airbags,Power Assisted Steering,Electric Windows,Central Locking,CD Player,Alarm,Air Conditioning,ABS",,N,Y,,,,,,,,,,,65.7,112,100,
43,623040,ML68DOH,WHITE,Diesel,2018,30000,PANEL VAN,4,Ford,Transit Custom,300 BASE P/V L1 H1,1995,14995,Manual,"https://aacarsdna.com/images/vehicles/40/large/5a7d1550f210f910bda821ce3fc3b40a.jpg,https://aacarsdna.com/images/vehicles/40/large/065a86c319a975ff4f8d8a5bcd33af1c.jpg,https://aacarsdna.com/images/vehicles/40/large/b5477206e85498ab29a7fe2c4383ab78.jpg,https://aacarsdna.com/images/vehicles/40/large/4c80de1aad8e6181bc45aa5bc90cf686.jpg,https://aacarsdna.com/images/vehicles/40/large/e5fd17c27ed5bfd2844c926a8840ab5c.jpg,https://aacarsdna.com/images/vehicles/40/large/3820ad5b1003338ae3d9000d4b0c5076.jpg,https://aacarsdna.com/images/vehicles/40/large/66795e4fa6cc8828a37ceb07daba55f8.jpg,https://aacarsdna.com/images/vehicles/40/large/b22f149075d39f60724a9897fe56609f.jpg,https://aacarsdna.com/images/vehicles/40/large/a9b78340355f954436f82a9f2b7469c9.jpg,https://aacarsdna.com/images/vehicles/40/large/f6c83699f751f1ae57e495814396eb50.jpg,https://aacarsdna.com/images/vehicles/40/large/bee172666d99f5a93f24ce98e9f8b523.jpg,https://aacarsdna.com/images/vehicles/40/large/6a38f72c369b0a218cdc1fc1476947c2.jpg",,,,,"Daytime Running Lights,Brake Assist,MP3 Player Connection,Steering Wheel Controls,Speakers,Cup Holders,V5 Registration Document,Full Service History,1 Owner,Traction Control,Safety Belts,Radio,Particule Filter,Engine Immobiliser,Bluetooth,Adjustable Steering,Front Airbags,Power Assisted Steering,Electric Windows,Central Locking,Alarm,ABS",,N,Y,,,,,,,,,,,45.6,167,103,
43,623042,WX68HXZ,WHITE,Petrol,2018,26008,CAR DERIVED VAN,5,Fiat,Doblo,16V SX,1368,9495,Manual,"https://aacarsdna.com/images/vehicles/42/large/44e7c7668c7f3dc50006d97a7c9e6990.jpg,https://aacarsdna.com/images/vehicles/42/large/7cbbb709bd0558abfef8287470ae6fab.jpg,https://aacarsdna.com/images/vehicles/42/large/3974a988ad76a4f305ff9caa4744cfa6.jpg,https://aacarsdna.com/images/vehicles/42/large/8bea7020686bbf2b8219cb4b087254eb.jpg,https://aacarsdna.com/images/vehicles/42/large/35237eb32306bee50beb3405a3283ee1.jpg,https://aacarsdna.com/images/vehicles/42/large/9dbf603f7551ebfbcc701fde581662a3.jpg,https://aacarsdna.com/images/vehicles/42/large/23772665dc6cd108ce5d80e265442cd9.jpg,https://aacarsdna.com/images/vehicles/42/large/3ad8487265bdf67357e9f2acb259372a.jpg,https://aacarsdna.com/images/vehicles/42/large/f85d60ae5a814f9d45f0e29ce283fe7a.jpg,https://aacarsdna.com/images/vehicles/42/large/c02ee81eeb71d44dde4f0d0852414885.jpg,https://aacarsdna.com/images/vehicles/42/large/de0b199fea9abc33782ffb01c31eb7f5.jpg,https://aacarsdna.com/images/vehicles/42/large/fd6f458c0f77ee3e0da1f3d30dcac253.jpg",,,,,"Daytime Running Lights,Brake Assist,Front Fog Lights,MP3 Player Connection,Speakers,Cup Holders,V5 Registration Document,Full Service History,1 Owner,Traction Control,Safety Belts,Radio,Engine Immobiliser,Electric Mirrors,Adjustable Steering,Front Airbags,Power Assisted Steering,Electric Windows,Central Locking,CD Player,Alarm,Air Conditioning,ABS",Ply Lined,N,Y,,,,,,,,,,,40.4,169,95,
43,623216,VNZ4221,WHITE,Diesel,2015,79000,PANEL VAN,5,Fiat,Ducato,35 MAXI H/R P/V XLB MULTIJET,2287,9995,Manual,"https://aacarsdna.com/images/vehicles/16/large/9d15c4fed20b71b18fcda6646d13eb67.jpg,https://aacarsdna.com/images/vehicles/16/large/dbe26d59193f4b74ab5104c60b6ccdaa.jpg,https://aacarsdna.com/images/vehicles/16/large/878ecf41ed575b8c42714899c76a475e.jpg,https://aacarsdna.com/images/vehicles/16/large/25bd3686b39a8705d70e5d8266cff925.jpg,https://aacarsdna.com/images/vehicles/16/large/f93559e86142f4bbd33eb1327c661c15.jpg,https://aacarsdna.com/images/vehicles/16/large/d89f9b0b5bb9cc697127ba70d6cd38b7.jpg,https://aacarsdna.com/images/vehicles/16/large/ecf9b334df2b70a42875765ca4bfbe29.jpg,https://aacarsdna.com/images/vehicles/16/large/c1fa620d4cfa2b0be7b73b10d4310939.jpg,https://aacarsdna.com/images/vehicles/16/large/d5857bc9a285c8ad7c501a0b32848d97.jpg,https://aacarsdna.com/images/vehicles/16/large/676a269bf4fe742a35ab0f98d6482ba3.jpg",,,,,"Daytime Running Lights,Brake Assist,ISOFix Anchor Point,Speakers,Cup Holders,V5 Registration Document,MOT,Full Service History,Traction Control,Safety Belts,Radio,Particule Filter,Electric Mirrors,Bluetooth,Adjustable Steering,Front Airbags,Power Assisted Steering,Electric Windows,Central Locking,Alarm,ABS","Ply Lined, No A/C",N,Y,,,,,,,,,,,39.8,186,148,
43,623555,HY65UXU,WHITE,Diesel,2015,115000,CAR DERIVED VAN,3,Ford,Fiesta,BASE TDCI,1499,3995,Manual,"https://aacarsdna.com/images/vehicles/55/large/42417f406e8d905964affe49e0d98556.jpg,https://aacarsdna.com/images/vehicles/55/large/3e1c1f83882f089335c114ac912d1e95.jpg,https://aacarsdna.com/images/vehicles/55/large/4dfef96600a95a76962ddb2c38c0900c.jpg,https://aacarsdna.com/images/vehicles/55/large/7dffc56a2451f9fca7e0f6ad56a3081d.jpg,https://aacarsdna.com/images/vehicles/55/large/53f0221b07afaf6d3d9ecc34788f53c8.jpg,https://aacarsdna.com/images/vehicles/55/large/33e080986af2edd166de8363cc977e98.jpg,https://aacarsdna.com/images/vehicles/55/large/db8c1aec158b4c87bb75318117e1cf51.jpg,https://aacarsdna.com/images/vehicles/55/large/50782073fe44d77520ed8cdb2e9552cf.jpg,https://aacarsdna.com/images/vehicles/55/large/263e8381c0d4e1fa8005bb76d55e0440.jpg,https://aacarsdna.com/images/vehicles/55/large/847ac9325156538eb819d5b61a53a320.jpg",,,,,"Daytime Running Lights,Brake Assist,Steering Wheel Controls,Speakers,Privacy/Tinted Glass,Cup Holders,Body Coloured Bumpers,V5 Registration Document,MOT,Full Service History,1 Owner,Traction Control,Safety Belts,Radio,Particule Filter,MP3,Electric Mirrors,Adjustable Steering,Front Airbags,Power Assisted Steering,Electric Windows,Central Locking,CD Player,Alarm,ABS",,N,Y,,,,,,,,,,,78.5,94,74,
43,624288,OU67MWF,WHITE,Diesel,2017,45000,PANEL VAN,5,Peugeot,Partner,BLUE HDI PROFESSIONAL L1,1560,7995,Manual,"https://aacarsdna.com/images/vehicles/88/large/fa7ac027a35ee3e6b2854b6a1fc5aa66.jpg,https://aacarsdna.com/images/vehicles/88/large/bbd35c275101e23927db80b22d56a01f.jpg,https://aacarsdna.com/images/vehicles/88/large/06e8d4491e0a32363bf3ff1aa05bdd67.jpg,https://aacarsdna.com/images/vehicles/88/large/4b37634185f904069cc87dd8df344810.jpg,https://aacarsdna.com/images/vehicles/88/large/cf511f97ae255f39d3879b2170350f36.jpg,https://aacarsdna.com/images/vehicles/88/large/ef59cee6565cce21546521492ddf5c1a.jpg,https://aacarsdna.com/images/vehicles/88/large/8124d9cffb4f6d2b9f6a64300a276b84.jpg,https://aacarsdna.com/images/vehicles/88/large/003d7536955e2715a69aa40eb3f24493.jpg,https://aacarsdna.com/images/vehicles/88/large/9d47fb0cfd527f5ad152eaa2a9e6e69b.jpg,https://aacarsdna.com/images/vehicles/88/large/49238838666d7edb58e866db4802f7a4.jpg,https://aacarsdna.com/images/vehicles/88/large/2dd15a43d0ba1886baf52efc40825dee.jpg",,,,,"Brake Assist,MP3 Player Connection,Steering Wheel Controls,Speakers,Cup Holders,V5 Registration Document,MOT,Full Service History,1 Owner,Traction Control,Satellite Navigation,Safety Belts,Radio,Particule Filter,Parking Sensors,Engine Immobiliser,Electric Mirrors,Bluetooth,Adjustable Steering,Front Airbags,Power Assisted Steering,Electric Windows,Central Locking,CD Player,Alarm,Air Conditioning,ABS",Ply Lined,N,Y,,,,,,,,,,,65.7,112,100,
43,624289,MM68KTF,WHITE,Diesel,2018,39000,PANEL VAN,5,Ford,Transit Custom,300 BASE P/V L1 H1,1995,13995,Manual,"https://aacarsdna.com/images/vehicles/89/large/d4eda5194c19c239038bb5541c39fc3e.jpg,https://aacarsdna.com/images/vehicles/89/large/6f906fff476218f38d4d8c5775fcf0f6.jpg,https://aacarsdna.com/images/vehicles/89/large/b2fc218597c16186efe6a5e252182a25.jpg,https://aacarsdna.com/images/vehicles/89/large/269c63bddf4bf3e2472e9b902fcd9b35.jpg,https://aacarsdna.com/images/vehicles/89/large/e956a93396b8709a799befb96aa4db9e.jpg,https://aacarsdna.com/images/vehicles/89/large/3af4897495fe5cbfc174bb5784fb355d.jpg,https://aacarsdna.com/images/vehicles/89/large/83bb19ae8a06d11fa5606642674ca20a.jpg,https://aacarsdna.com/images/vehicles/89/large/397083d387e99d1139adaed1d4600e6a.jpg,https://aacarsdna.com/images/vehicles/89/large/189daf9e1f6fa473510452f43c62f902.jpg,https://aacarsdna.com/images/vehicles/89/large/2e13d7ab041e27fb0a5293a998f8c08c.jpg,https://aacarsdna.com/images/vehicles/89/large/d5927915ad11841130f222714582ffcd.jpg,https://aacarsdna.com/images/vehicles/89/large/00f7f9b4811c1f42814dd62286c0f458.jpg",,,,,"Daytime Running Lights,Brake Assist,MP3 Player Connection,Steering Wheel Controls,Speakers,Cup Holders,V5 Registration Document,Full Service History,1 Owner,Traction Control,Safety Belts,Radio,Particule Filter,Engine Immobiliser,Bluetooth,Adjustable Steering,Front Airbags,Power Assisted Steering,Electric Windows,Central Locking,Alarm,ABS",Ply Lined,N,Y,,,,,,,,,,,45.6,167,103,
43,624618,MJ19ZWM,WHITE,Diesel,2019,49000,PANEL VAN,5,Ford,Transit Custom,300 BASE P/V L1 H1,1995,13995,Manual,"https://aacarsdna.com/images/vehicles/18/large/82af42dd77ba2bb68cfd3b5e5331fe65.jpg,https://aacarsdna.com/images/vehicles/18/large/ef74d855336ffd57fd63884cfef56aa4.jpg,https://aacarsdna.com/images/vehicles/18/large/2055f913b92068e36aa5ad950981049c.jpg,https://aacarsdna.com/images/vehicles/18/large/2918ad89031943a700b1d3e46f1682dc.jpg,https://aacarsdna.com/images/vehicles/18/large/1e0a6a1d42d0476d53d5cb8f70da6627.jpg,https://aacarsdna.com/images/vehicles/18/large/74b8c4e2389d8af17a1191311ff8933c.jpg,https://aacarsdna.com/images/vehicles/18/large/233fd2ed8a6f41c3a9f31c5a900bf884.jpg,https://aacarsdna.com/images/vehicles/18/large/64102dd6bb7d5465b3111059a0b0d2d0.jpg,https://aacarsdna.com/images/vehicles/18/large/b06ef8fa918ef3f49a752ea6bbd93e89.jpg,https://aacarsdna.com/images/vehicles/18/large/0e572322124566f6ced758994a5b96fe.jpg,https://aacarsdna.com/images/vehicles/18/large/10f1b2de58dceb728b51a5f391fa3ed3.jpg,https://aacarsdna.com/images/vehicles/18/large/5b0489d6b633f0534daf44c019d70fa8.jpg",,,,,"Daytime Running Lights,Brake Assist,MP3 Player Connection,Steering Wheel Controls,Speakers,Cup Holders,V5 Registration Document,Full Service History,1 Owner,Traction Control,Safety Belts,Radio,Particule Filter,Engine Immobiliser,Bluetooth,Adjustable Steering,Front Airbags,Power Assisted Steering,Electric Windows,Central Locking,Alarm,ABS",Ply Lined,N,Y,,,,,,,,,,,45.6,167,103,
43,624669,MD68EEB,WHITE,Diesel,2018,26006,PANEL VAN,5,Ford,Transit Connect,210 BASE TDCI,1499,12495,Manual,"https://aacarsdna.com/images/vehicles/69/large/1d5e1f571840bcbf971d657f6655fd26.jpg,https://aacarsdna.com/images/vehicles/69/large/4578d4b795cbe69753f83c0a6e4e8b10.jpg,https://aacarsdna.com/images/vehicles/69/large/99cf993828ea214ecbabbf6455fda7fb.jpg,https://aacarsdna.com/images/vehicles/69/large/b64e05f717dbc8032923761be463ec21.jpg,https://aacarsdna.com/images/vehicles/69/large/4b7f1c575f0c33c536a44440bfb169d7.jpg,https://aacarsdna.com/images/vehicles/69/large/9d951d0fca2dd5681b6807cf7df49038.jpg,https://aacarsdna.com/images/vehicles/69/large/c79014e7c5076f8ca68ee45bb310e4ee.jpg,https://aacarsdna.com/images/vehicles/69/large/c112bfba6f213aff6cfa95ebb7af2e97.jpg,https://aacarsdna.com/images/vehicles/69/large/4e91ed4645febea779a08add8b2bf7a3.jpg,https://aacarsdna.com/images/vehicles/69/large/85425650f0cfe8b8ce74dc3319db6d7f.jpg",,,,,"Daytime Running Lights,Brake Assist,MP3 Player Connection,Steering Wheel Controls,Speakers,Cup Holders,Body Coloured Bumpers,Start Stop System,V5 Registration Document,Full Service History,1 Owner,Traction Control,Safety Belts,Radio,Particule Filter,Engine Immobiliser,Electric Mirrors,Bluetooth,Adjustable Steering,Front Airbags,Power Assisted Steering,Electric Windows,Central Locking,CD Player,ABS",,N,Y,,,,,,,,,,,0,123,99,
43,625009,NU16UYG,WHITE,Diesel,2016,51990,PANEL VAN,5,Peugeot,Partner,HDI CRC,1560,7995,Manual,"https://aacarsdna.com/images/vehicles/09/large/9a06f90a422f5c14ef6622444b4eed7e.jpg,https://aacarsdna.com/images/vehicles/09/large/afb74f2e0ead5bfa5b34f6d09ce12edd.jpg,https://aacarsdna.com/images/vehicles/09/large/9cf870b42c716bb4ade7de7bca6a440e.jpg,https://aacarsdna.com/images/vehicles/09/large/1cae305c3228c0bfb0b13676d2a36790.jpg,https://aacarsdna.com/images/vehicles/09/large/01ec59e9d25dc9c84a453e36233bf7b2.jpg,https://aacarsdna.com/images/vehicles/09/large/afaecadc6e3c607179157b11157b1ac1.jpg,https://aacarsdna.com/images/vehicles/09/large/df167b8463dd5c4a5a52043fdfcc8c10.jpg,https://aacarsdna.com/images/vehicles/09/large/55fc50b0456936bb76497b82070bd700.jpg,https://aacarsdna.com/images/vehicles/09/large/59ab134ec1927ac6a47296f9c33d818e.jpg,https://aacarsdna.com/images/vehicles/09/large/e3dcb0452e7825d96908e73b1577276f.jpg,https://aacarsdna.com/images/vehicles/09/large/a307ce7144aa74ca68e1912ed7473efe.jpg",,,,,"Brake Assist,MP3 Player Connection,Steering Wheel Controls,Speakers,Cup Holders,V5 Registration Document,MOT,Full Service History,1 Owner,Traction Control,Safety Belts Rear,Safety Belts,Radio,Particule Filter,Engine Immobiliser,Electric Mirrors,Bluetooth,Adjustable Steering,Front Airbags,Power Assisted Steering,Electric Windows,Central Locking,CD Player,ABS",,N,Y,,,,,,,,,,,50.4,147,92,
43,625553,OY67EBF,WHITE,Diesel,2017,38000,PANEL VAN,5,Peugeot,Partner,BLUE HDI PROFESSIONAL L1,1560,8395,Manual,"https://aacarsdna.com/images/vehicles/53/large/50a940bc42885ac1be88ee16ddd43f5b.jpg,https://aacarsdna.com/images/vehicles/53/large/cf7afca6490a14cacc7b1aeb253de3ca.jpg,https://aacarsdna.com/images/vehicles/53/large/537646d8912c0fc244c2dcac4b9a617c.jpg,https://aacarsdna.com/images/vehicles/53/large/d846c5f0c915119ca9df65c3e0691845.jpg,https://aacarsdna.com/images/vehicles/53/large/67b1b285a5b376636407f6331cb14150.jpg,https://aacarsdna.com/images/vehicles/53/large/f0731ec11a11df40b26d521556d4720b.jpg,https://aacarsdna.com/images/vehicles/53/large/1bb49520336d584d61d5e5fbea5723ef.jpg,https://aacarsdna.com/images/vehicles/53/large/1b71091ffe1d820bc50358743ec17db9.jpg,https://aacarsdna.com/images/vehicles/53/large/904c4ba361c1cb3a881eca11c75cfb2c.jpg,https://aacarsdna.com/images/vehicles/53/large/f4df7109309fb9f9ecba18512c130070.jpg,https://aacarsdna.com/images/vehicles/53/large/75173886f1f5c821c70a173f5b91dc26.jpg",,,,,"Brake Assist,MP3 Player Connection,Steering Wheel Controls,Speakers,Cup Holders,V5 Registration Document,MOT,Full Service History,1 Owner,Traction Control,Satellite Navigation,Safety Belts,Radio,Particule Filter,Parking Sensors,Engine Immobiliser,Electric Mirrors,Bluetooth,Adjustable Steering,Front Airbags,Power Assisted Steering,Electric Windows,Central Locking,CD Player,Alarm,Air Conditioning,ABS","Ply Lined ,",N,Y,,,,,,,,,,,65.7,112,100,